{"text_format":"1","workbook":"xlsx","n_sheets":15,"sheets":["必ずお読み下さい","春季入力","男一覧","女一覧","男個票","女個票","ﾘﾚｰ個票","部員名簿","登録データ貼付","競技者マスタ（NANS）","競技者マスタ（上陸）","男子一覧(手書用)","女子一覧(手書用)","個人個票(手書用)","リレー個票(手書用)"],"not_rendered":{"charts":0,"images":0,"macros":1,"external_links":0,"defined_names":13,"comments":0,"pivot_tables":0},"unopened":[],"bounds":{"document_bytes":16777216,"sheet_cells":100000,"rows_first":2000,"rows_last":500,"rows_between":2000,"halvings":0,"cell_chars":16384,"cell_head_chars":4096},"cells_cut":0,"cells_raw":0,"read":"whole","date_system":"1900"}

{"sheet":"必ずお読み下さい","index":0,"n_rows":33,"n_cols":9,"rows_kept":33,"cut":false,"hidden":false,"merged":[[1,0,1,2],[0,0,0,2],[2,0,2,2]]}
[]
["必ず全部読んで下さい！"]
["市春季大会申込書の作成マニュアル"]
[null,"最初に"]
[null,null,"　３年間使用するアスリートビブス番号を導入し、秋田市・秋田県の大会では中学校３年間を同じ番号で競技することになりました。そのため、新２・３年生はすでにアスリートビブス番号を取得していることになります。そこで、春季大会もこの番号を使うことにします。昨年度の登録データを「登録データ貼付」シートに貼り付けて作業を行ってください。担当者が変わった学校は、引き継ぎを確実にお願いします。入力に関しては、この説明書をよく読んで準備を進めてください。\n"]
[null,null,"　作業の手順は以下の通りです。\n　　①「登録データ貼付」に昨年のデータを貼り付ける。（学年を一つ増やす）\n　　②「春季入力」シートで，必要なデータを入力する。\n　　③「一覧表」，「個票」などを印刷（女子はカラー印刷）し，個票は切り離して抽選会に持参する。\n　　④入力完了した「市春季申し込み【学校名】」ファイルの学校名の部分を書き換えて，桜中の伊藤賢悦まで\n　　　送る。（春季大会のプログラム編成会議が締め切りです。事前に送って頂くか，編成会議当日に持参して\n　　　下さい。）\n　年度初めの忙しい時期ではありますが，どうかご協力のほどよろしくお願いします。"]
{"$rows_left_out":28}
{"sheet":"春季入力","index":1,"n_rows":132,"n_cols":22,"rows_kept":132,"cut":false,"hidden":false,"merged":[[65,1,65,2],[65,11,67,11],[66,1,66,2],[66,5,67,5],[7,5,8,5],[7,1,7,2],[64,1,64,2],[2,10,2,11],[61,1,61,3],[62,1,62,2],[63,1,63,2],[61,10,61,11],[2,1,2,3],[3,1,3,2],[4,1,4,2],[5,1,5,2],[6,1,6,2],[6,10,6,11],[5,10,5,11]]}
[]
["市春季男子"]
[null,"一覧表用データ",null,null,null,null,null,null,null,null,"個表用データ"]
[null,"学校名",null,{"$f":"IF(必ずお読み下さい!H10=\"\",\"\",必ずお読み下さい!H10)","v":""},null,null,null,null,null,null,"学校名（略称）",{"$f":"IF(必ずお読み下さい!I10=\"\",\"\",必ずお読み下さい!I10)","v":""}]
[null,"監督氏名",null,null,"※"]
[null,"校長名",null,null,"※"]
{"$rows_left_out":127}
{"sheet":"男一覧","index":2,"n_rows":69,"n_cols":45,"rows_kept":69,"cut":false,"hidden":false,"merged":[[51,2,51,4],[51,7,51,11],[51,12,51,16],[1,0,1,17],[2,2,2,9],[3,2,3,9],[3,17,3,18],[2,11,2,14],[3,11,3,14],[42,15,42,17],[55,19,55,23],[56,19,56,21],[6,19,6,23],[5,19,5,23],[7,19,7,23],[8,19,8,23],[16,19,16,23],[17,19,17,23],[18,19,18,23],[15,19,15,23],[22,19,22,23],[23,19,23,23],[32,19,32,23],[33,19,33,23],[34,19,34,23],[27,19,27,23],[4,19,4,23],[55,2,56,3],[1,25,2,25],[9,19,9,23],[10,19,10,23],[11,19,11,23],[12,19,12,23],[13,19,13,23],[14,19,14,23],[3,15,3,16],[24,19,24,23],[19,19,19,23],[25,19,25,23],[26,19,26,23],[20,19,20,23],[21,19,21,23],[28,19,28,23],[29,19,29,23],[30,19,30,23],[31,19,31,23],[47,7,47,8],[35,19,35,23],[45,1,45,17],[36,19,36,23],[43,0,43,11],[37,19,37,23],[38,19,38,23],[39,19,39,23],[47,9,47,15],[47,1,47,5],[42,12,42,13]]}
[]
[{"$f":"CONCATENATE(B68,C68,D68)","v":"令和 7年度　秋田市中学校春季陸上競技大会　参加申込書一覧〔男子〕"}]
[null,"学校名(",{"$f":"IF(B48=\"立　　　　　　　　　\",\"\",B48)","v":""},null,null,null,null,null,null,null,")"]
[null,"監督名(",{"$f":"IF(春季入力!D5=\"\",\"\",春季入力!D5)","v":""},null,null,null,null,null,null,null,")","参加人数(",null,null,null,{"$f":"IF(COUNTA(春季入力!C12:C46)=0,\"\",COUNTA(春季入力!C12:C46))","v":""},null,")名"]
["ナンバー\nカード","氏　　名","フリガナ","学年","２年\n100","３年\n100","共通\n200","共通\n400","共通\n800","共通\n1500","共通\n3000","共通\n110H","共通\n走高","共通\n棒高","共通\n走幅","共通\n砲丸",null,"共通\n400R",null,"個人情報の記載"]
[{"$f":"IF(春季入力!C12=\"\",\"\",春季入力!C12)","v":""},{"$f":"IF(春季入力!D12=\"\",\"\",春季入力!D12)","v":""},{"$f":"IF(春季入力!F12=\"\",\"\",春季入力!F12)","v":""},{"$f":"IF(春季入力!E12=\"\",\"\",春季入力!E12)","v":""},{"$f":"IF(春季入力!$H12=1,\"○\",\"\")","v":""},{"$f":"IF(春季入力!$H12=2,\"○\",\"\")","v":""},{"$f":"IF(春季入力!$H12=3,\"○\",\"\")","v":""},{"$f":"IF(春季入力!$H12=4,\"○\",\"\")","v":""},{"$f":"IF(春季入力!$H12=5,\"○\",\"\")","v":""},{"$f":"IF(春季入力!$H12=6,\"○\",\"\")","v":""},{"$f":"IF(春季入力!$H12=7,\"○\",\"\")","v":""},{"$f":"IF(春季入力!$H12=8,\"○\",\"\")","v":""},{"$f":"IF(春季入力!$H12=9,\"○\",\"\")","v":""},{"$f":"IF(春季入力!$H12=10,\"○\",\"\")","v":""},{"$f":"IF(春季入力!$H12=11,\"○\",\"\")","v":""},{"$f":"IF(春季入力!$H12=12,\"○\",\"\")","v":""},null,{"$f":"IF(春季入力!$I12=18,\"○\",\"\")","v":""},null,{"$f":"IF(春季入力!N12=\"\",\"\",春季入力!N12)","v":""},null,null,null,null,null,null,null,null,null,null,null,null,null,null,null,null,null,null,null,null,null,null,null,null,"○"]
{"$rows_left_out":64}
{"sheet":"女一覧","index":3,"n_rows":59,"n_cols":45,"rows_kept":59,"cut":false,"hidden":false,"merged":[[3,15,3,16],[1,0,1,16],[40,1,40,15],[2,2,2,7],[3,2,3,7],[3,9,3,12],[3,13,3,14],[50,17,50,20],[38,0,38,9],[4,17,4,20],[5,17,5,20],[50,2,51,3],[51,17,51,18],[6,17,6,20],[7,17,7,20],[8,17,8,20],[9,17,9,20],[14,17,14,20],[15,17,15,20],[16,17,16,20],[17,17,17,20],[10,17,10,20],[11,17,11,20],[12,17,12,20],[13,17,13,20],[22,17,22,20],[23,17,23,20],[24,17,24,20],[25,17,25,20],[18,17,18,20],[19,17,19,20],[20,17,20,20],[21,17,21,20],[30,17,30,20],[31,17,31,20],[32,17,32,20],[33,17,33,20],[26,17,26,20],[27,17,27,20],[28,17,28,20],[29,17,29,20],[49,0,49,16],[46,2,46,3],[46,5,46,9],[34,17,34,20],[46,10,46,14],[42,7,42,8],[42,9,42,14],[42,1,42,5],[37,10,37,11],[37,13,37,15]]}
[]
[{"$f":"CONCATENATE(男一覧!B68,男一覧!C68,男一覧!D69)","v":"令和 7年度　秋田市中学校春季陸上競技大会　参加申込書一覧〔女子〕"}]
[null,"学校名(",{"$f":"IF(B43=\"立　　　　　　　　　　\",\"\",B43)","v":""},null,null,null,null,null,")"]
[null,"監督名(",{"$f":"IF(春季入力!D64=\"\",\"\",春季入力!D64)","v":""},null,null,null,null,null,")","参加人数(",null,null,null,{"$f":"IF(COUNTA(春季入力!C71:C100)=0,\"\",COUNTA(春季入力!C71:C100))","v":""},null,")名"]
["ナンバー\nカード","氏    名","フリガナ","学年","２年\n100","３年\n100","共通\n200","共通\n800","２年\n1500","３年\n1500","共通\n100H","共通\n走高","共通\n走幅","共通\n砲丸",null,"共通\n400R",null,"個人情報の記載"]
[{"$f":"IF(春季入力!C71=\"\",\"\",春季入力!C71)","v":""},{"$f":"IF(春季入力!D71=\"\",\"\",春季入力!D71)","v":""},{"$f":"IF(春季入力!F71=\"\",\"\",春季入力!F71)","v":""},{"$f":"IF(春季入力!E71=\"\",\"\",春季入力!E71)","v":""},{"$f":"IF(春季入力!$H71=21,\"○\",\"\")","v":""},{"$f":"IF(春季入力!$H71=22,\"○\",\"\")","v":""},{"$f":"IF(春季入力!$H71=23,\"○\",\"\")","v":""},{"$f":"IF(春季入力!$H71=24,\"○\",\"\")","v":""},{"$f":"IF(春季入力!$H71=25,\"○\",\"\")","v":""},{"$f":"IF(春季入力!$H71=26,\"○\",\"\")","v":""},{"$f":"IF(春季入力!$H71=27,\"○\",\"\")","v":""},{"$f":"IF(春季入力!$H71=28,\"○\",\"\")","v":""},{"$f":"IF(春季入力!$H71=29,\"○\",\"\")","v":""},{"$f":"IF(春季入力!$H71=30,\"○\",\"\")","v":""},null,{"$f":"IF(春季入力!$I71=38,\"○\",\"\")","v":""},null,{"$f":"IF(春季入力!N71=\"\",\"\",春季入力!N71)","v":""},null,null,null,null,null,null,null,null,null,null,null,null,null,null,null,null,null,null,null,null,null,null,null,null,null,null,"○"]
{"$rows_left_out":54}
{"sheet":"男個票","index":4,"n_rows":73,"n_cols":33,"rows_kept":73,"cut":false,"hidden":false,"merged":[[1,0,2,1],[5,0,5,1],[7,0,7,1],[3,0,3,1],[47,0,47,1],[37,0,37,1],[29,0,29,1],[31,0,31,1],[25,0,25,1],[27,0,27,1],[17,0,17,1],[19,0,19,1],[69,11,72,11],[47,11,68,11],[25,11,46,11],[67,0,67,1],[69,0,69,1],[71,0,71,1],[51,0,51,1],[45,0,45,1],[53,0,53,1],[55,0,55,1],[49,0,49,1],[39,0,39,1],[33,0,33,1],[35,0,35,1],[65,0,65,1],[61,0,61,1],[3,11,24,11],[13,0,13,1],[15,0,15,1],[9,0,9,1],[11,0,11,1],[21,0,21,1],[23,0,23,1],[63,0,63,1],[57,0,57,1],[59,0,59,1],[41,0,41,1],[43,0,43,1]]}
[]
["個人種目個票"]
[]
["種　　　目",null,"組","ﾚｰﾝ・順","ナンバーカード","名　　　　前","学　　校","学年","ベスト記録","個人情報の掲載",null,"1ページ目",null,"個人種目１",null,1,2,3,4,5,6,7,8,9,10,11,12,13,14,15,16,17,18]
["男",{"$f":"IF(N5=\"\",\"\",HLOOKUP(N5,$P$4:$AG$5,2,FALSE))","v":""},null,null,{"$f":"IF(男一覧!A6=\"\",\"\",男一覧!A6)","v":""},{"$f":"IF(男一覧!B6=\"\",\"\",男一覧!B6)","v":""},{"$f":"IF(F5=\"\",\"\",春季入力!$L$4)","v":""},{"$f":"IF(男一覧!D6=\"\",\"\",男一覧!D6)","v":""},{"$f":"IF(春季入力!K12=\"\",\"\",春季入力!K12)","v":""},{"$f":"IF(男一覧!T6=\"\",\"\",男一覧!T6)","v":""},1,null,1,{"$f":"IF(春季入力!H12=\"\",\"\",春季入力!H12)","v":""},null,{"$f":"男一覧!E5","v":"２年\n100"},{"$f":"男一覧!F5","v":"３年\n100"},{"$f":"男一覧!G5","v":"共通\n200"},{"$f":"男一覧!H5","v":"共通\n400"},{"$f":"男一覧!I5","v":"共通\n800"},{"$f":"男一覧!J5","v":"共通\n1500"},{"$f":"男一覧!K5","v":"共通\n3000"},{"$f":"男一覧!L5","v":"共通\n110H"},{"$f":"男一覧!M5","v":"共通\n走高"},{"$f":"男一覧!N5","v":"共通\n棒高"},{"$f":"男一覧!O5","v":"共通\n走幅"},{"$f":"男一覧!P5","v":"共通\n砲丸"},{"$f":"男一覧!Q5","v":0},{"$f":"男一覧!R5","v":"共通\n400R"},{"$f":"男一覧!S5","v":0},{"$f":"男一覧!T5","v":"個人情報の記載"},{"$f":"男一覧!U5","v":0},{"$f":"男一覧!V5","v":0}]
["種　　　目",null,"組","ﾚｰﾝ・順","ナンバーカード","名　　　　前","学　　校","学年","ベスト記録","個人情報の掲載"]
{"$rows_left_out":68}
{"sheet":"女個票","index":5,"n_rows":63,"n_cols":33,"rows_kept":63,"cut":false,"hidden":false,"merged":[[47,11,62,11],[25,11,46,11],[3,11,24,11],[9,0,9,1],[11,0,11,1],[5,0,5,1],[7,0,7,1],[17,0,17,1],[27,0,27,1],[21,0,21,1],[23,0,23,1],[33,0,33,1],[19,0,19,1],[13,0,13,1],[43,0,43,1],[37,0,37,1],[3,0,3,1],[1,0,2,1],[35,0,35,1],[29,0,29,1],[31,0,31,1],[41,0,41,1],[15,0,15,1],[25,0,25,1],[51,0,51,1],[45,0,45,1],[47,0,47,1],[49,0,49,1],[39,0,39,1],[61,0,61,1],[57,0,57,1],[59,0,59,1],[53,0,53,1],[55,0,55,1]]}
[]
["個人種目個票"]
[]
["種　　　目",null,"組","ﾚｰﾝ・順","ナンバーカード","名　　　　前","学　　校","学年","ベスト記録","個人情報の掲載",null,"１ページ目",null,"個人種目１",null,21,22,23,24,25,26,27,28,29,30,11,38,13,14,15]
["女",{"$f":"IF(N5=\"\",\"\",HLOOKUP(N5,$P$4:$AG$5,2,FALSE))","v":""},null,null,{"$f":"IF(女一覧!A6=\"\",\"\",女一覧!A6)","v":""},{"$f":"IF(女一覧!B6=\"\",\"\",女一覧!B6)","v":""},{"$f":"IF(F5=\"\",\"\",春季入力!$L$4)","v":""},{"$f":"IF(女一覧!D6=\"\",\"\",女一覧!D6)","v":""},{"$f":"IF(春季入力!K71=\"\",\"\",春季入力!K71)","v":""},{"$f":"IF(女一覧!R6=\"\",\"\",女一覧!R6)","v":""},1,null,1,{"$f":"IF(春季入力!H71=\"\",\"\",春季入力!H71)","v":""},null,{"$f":"女一覧!E5","v":"２年\n100"},{"$f":"女一覧!F5","v":"３年\n100"},{"$f":"女一覧!G5","v":"共通\n200"},{"$f":"女一覧!H5","v":"共通\n800"},{"$f":"女一覧!I5","v":"２年\n1500"},{"$f":"女一覧!J5","v":"３年\n1500"},{"$f":"女一覧!K5","v":"共通\n100H"},{"$f":"女一覧!L5","v":"共通\n走高"},{"$f":"女一覧!M5","v":"共通\n走幅"},{"$f":"女一覧!N5","v":"共通\n砲丸"},{"$f":"女一覧!O5","v":0},{"$f":"女一覧!P5","v":"共通\n400R"},{"$f":"女一覧!Q5","v":0},{"$f":"女一覧!R5","v":"個人情報の記載"},{"$f":"女一覧!S5","v":0},{"$f":"女一覧!T5","v":0},{"$f":"女一覧!U5","v":0},{"$f":"女一覧!V5","v":0}]
["種　　　目",null,"組","ﾚｰﾝ・順","ナンバーカード","名　　　　前","学　　校","学年","ベスト記録","個人情報の掲載"]
{"$rows_left_out":58}
{"sheet":"ﾘﾚｰ個票","index":6,"n_rows":26,"n_cols":9,"rows_kept":26,"cut":false,"hidden":false,"merged":[[22,0,23,0],[8,0,9,0],[1,0,2,0],[15,0,16,0],[20,8,25,8],[20,1,25,1],[20,2,25,2],[20,3,25,3],[6,8,11,8],[6,1,11,1],[6,2,11,2],[6,3,11,3]]}
[]
["男子"]
[]
[]
[]
["種　　　目","組","レーン","学校名","ナンバーカード","名　　　前","学年","個人情報の\n掲載","ベスト記録"]
{"$rows_left_out":21}
{"sheet":"部員名簿","index":7,"n_rows":103,"n_cols":29,"rows_kept":103,"cut":false,"hidden":false,"merged":[[4,24,4,25]]}
["部員名簿（通年ナンバー）一覧"]
[{"$f":"VLOOKUP(W5,U8:AA34,6,FALSE)","v":{"$error":"#N/A"}}]
[]
["通年ナンバー","JAAF ID","氏　名","フリガナ","氏名英語表記","学年","性別",null,null,null,"氏名","フリガナ","ﾌﾘｶﾞﾅ","英字","学年","性別","生年月日"]
[{"$f":"IF(登録データ貼付!E2=\"\",\"\",登録データ貼付!E2)","v":""},{"$f":"IF(登録データ貼付!B2=\"\",\"\",登録データ貼付!B2)","v":""},{"$f":"IF(K5=\"\",\"\",K5)","v":""},{"$f":"IF(M5=\"\",\"\",M5)","v":""},{"$f":"IF(N5=\"\",\"\",N5)","v":""},{"$f":"IF(O5=\"\",\"\",O5)","v":""},{"$f":"IF(P5=\"\",\"\",P5)","v":""},null,null,null,{"$f":"IF(登録データ貼付!C2=\"\",\"\",登録データ貼付!C2&\"　\"&登録データ貼付!D2)","v":""},{"$f":"IF(登録データ貼付!F2=\"\",\"\",登録データ貼付!F2&\"　\"&登録データ貼付!G2)","v":""},{"$f":"ASC(L5)","v":""},{"$f":"IF(登録データ貼付!H2=\"\",\"\",登録データ貼付!H2&\" \"&登録データ貼付!I2)","v":""},{"$f":"IF(登録データ貼付!V2=\"\",\"\",RIGHT(登録データ貼付!V2,1))","v":""},{"$f":"IF(登録データ貼付!K2=\"\",\"\",LEFT(登録データ貼付!K2,1))","v":""},{"$f":"IF(登録データ貼付!S2=\"\",\"\",登録データ貼付!S2)","v":""},null,null,"01",null,"学校名",{"$f":"IF(必ずお読み下さい!G10=\"\",\"\",必ずお読み下さい!G10)","v":28}]
[{"$f":"IF(登録データ貼付!E3=\"\",\"\",登録データ貼付!E3)","v":""},{"$f":"IF(登録データ貼付!B3=\"\",\"\",登録データ貼付!B3)","v":""},{"$f":"IF(K6=\"\",\"\",K6)","v":""},{"$f":"IF(M6=\"\",\"\",M6)","v":""},{"$f":"IF(N6=\"\",\"\",N6)","v":""},{"$f":"IF(O6=\"\",\"\",O6)","v":""},{"$f":"IF(P6=\"\",\"\",P6)","v":""},null,null,null,{"$f":"IF(登録データ貼付!C3=\"\",\"\",登録データ貼付!C3&\"　\"&登録データ貼付!D3)","v":""},{"$f":"IF(登録データ貼付!F3=\"\",\"\",登録データ貼付!F3&\"　\"&登録データ貼付!G3)","v":""},{"$f":"ASC(L6)","v":""},{"$f":"IF(登録データ貼付!H3=\"\",\"\",登録データ貼付!H3&\" \"&登録データ貼付!I3)","v":""},{"$f":"IF(登録データ貼付!V3=\"\",\"\",RIGHT(登録データ貼付!V3,1))","v":""},{"$f":"IF(登録データ貼付!K3=\"\",\"\",LEFT(登録データ貼付!K3,1))","v":""},{"$f":"IF(登録データ貼付!S3=\"\",\"\",登録データ貼付!S3)","v":""},null,null,"02",null,"学校コード",{"$f":"IF(W5=\"\",\"\",VLOOKUP(W5,U8:Y103,5,FALSE))","v":{"$error":"#N/A"}}]
{"$rows_left_out":98}
{"sheet":"登録データ貼付","index":8,"n_rows":1,"n_cols":43,"rows_kept":1,"cut":false,"hidden":false,"merged":[]}
["年度","JAAF ID","氏名（姓）","氏名（名）","登録番号","フリガナ（姓）","フリガナ（名）","英字（姓）","英字（名）","国籍","性別","登録都道府県番号","登録都道府県名","団体UID","団体ID","団体名","団体名略称1","団体名略称2","生年月日","旧団体コード","備考","学年","団体区分","承認団体名","郵便番号","住所","携帯電話番号","卒業高校名","卒業中学名","メールアドレス","E-mail配信希望","勤務先名","勤務先郵便番号","勤務先都道府県","勤務先市区町村 / 番地 / 建物名","在籍学校都道府県","障がいのクラス","実施している種目","興味がある種目","指導者チェック","役職名","管理者","状態"]

{"sheet":"競技者マスタ（NANS）","index":9,"n_rows":70,"n_cols":36,"rows_kept":70,"cut":false,"hidden":false,"merged":[]}
["競技者NO","所属コード1","所属コード2","ナンバー","ナンバー2","競技者名","競技者名カナ","競技者名略称","競技者名英字","国籍","性別","学年","生年","月日","個人所属地名","陸連コード","参加競技-競技コード1","参加競技-自己記録1","参加競技-オープン参加FLG1","参加競技-記録FLG1","参加競技-競技コード2","参加競技-自己記録2","参加競技-オープン参加FLG2","参加競技-記録FLG2","参加競技-競技コード3","参加競技-自己記録3","参加競技-オープン参加FLG3","参加競技-記録FLG3","参加競技-競技コード4","参加競技-自己記録4","参加競技-オープン参加FLG4","参加競技-記録FLG4","参加競技-競技コード5","参加競技-自己記録5","参加競技-オープン参加FLG5","参加競技-記録FLG5"]
[null,{"$f":"IF(E2=\"\",\"\",必ずお読み下さい!$G$10)","v":""},null,null,{"$f":"IF(春季入力!C12=\"\",\"\",春季入力!C12)","v":""},{"$f":"IF(春季入力!D12=\"\",\"\",春季入力!D12)","v":""},{"$f":"IF(春季入力!G12=\"\",\"\",春季入力!G12)","v":""},{"$f":"IF(春季入力!D12=\"\",\"\",春季入力!D12)","v":""},{"$f":"IF(春季入力!G12=\"\",\"\",春季入力!G12)","v":""},{"$f":"IF(E2=\"\",\"\",\"JPN\")","v":""},{"$f":"IF(春季入力!P12=\"\",\"\",春季入力!P12)","v":""},{"$f":"IF(春季入力!E12=\"\",\"\",春季入力!E12)","v":""},{"$f":"IF(E2=\"\",\"\",VLOOKUP($E2,部員名簿!$A$5:$R$103,17,FALSE))","v":""},{"$f":"IF(E2=\"\",\"\",VLOOKUP($E2,部員名簿!$A$5:$R$103,17,FALSE))","v":""},null,{"$f":"IF(E2=\"\",\"\",VLOOKUP($E2,部員名簿!$A$5:$G$103,2,FALSE))","v":""},{"$f":"IF(春季入力!H12=\"\",\"\",春季入力!H12)","v":""},null,{"$f":"IF(Q2=\"\",\"\",0)","v":""},{"$f":"IF(Q2=\"\",\"\",0)","v":""},{"$f":"IF(春季入力!I12=\"\",\"\",春季入力!I12)","v":""},null,{"$f":"IF(U2=\"\",\"\",0)","v":""},{"$f":"IF(U2=\"\",\"\",0)","v":""}]
[null,{"$f":"IF(E3=\"\",\"\",必ずお読み下さい!$G$10)","v":""},null,null,{"$f":"IF(春季入力!C13=\"\",\"\",春季入力!C13)","v":""},{"$f":"IF(春季入力!D13=\"\",\"\",春季入力!D13)","v":""},{"$f":"IF(春季入力!G13=\"\",\"\",春季入力!G13)","v":""},{"$f":"IF(春季入力!D13=\"\",\"\",春季入力!D13)","v":""},{"$f":"IF(春季入力!G13=\"\",\"\",春季入力!G13)","v":""},{"$f":"IF(E3=\"\",\"\",\"JPN\")","v":""},{"$f":"IF(春季入力!P13=\"\",\"\",春季入力!P13)","v":""},{"$f":"IF(春季入力!E13=\"\",\"\",春季入力!E13)","v":""},{"$f":"IF(E3=\"\",\"\",VLOOKUP($E3,部員名簿!$A$5:$R$103,17,FALSE))","v":""},{"$f":"IF(E3=\"\",\"\",VLOOKUP($E3,部員名簿!$A$5:$R$103,17,FALSE))","v":""},null,{"$f":"IF(E3=\"\",\"\",VLOOKUP($E3,部員名簿!$A$5:$G$103,2,FALSE))","v":""},{"$f":"IF(春季入力!H13=\"\",\"\",春季入力!H13)","v":""},null,{"$f":"IF(Q3=\"\",\"\",0)","v":""},{"$f":"IF(Q3=\"\",\"\",0)","v":""},{"$f":"IF(春季入力!I13=\"\",\"\",春季入力!I13)","v":""},null,{"$f":"IF(U3=\"\",\"\",0)","v":""},{"$f":"IF(U3=\"\",\"\",0)","v":""}]
[null,{"$f":"IF(E4=\"\",\"\",必ずお読み下さい!$G$10)","v":""},null,null,{"$f":"IF(春季入力!C14=\"\",\"\",春季入力!C14)","v":""},{"$f":"IF(春季入力!D14=\"\",\"\",春季入力!D14)","v":""},{"$f":"IF(春季入力!G14=\"\",\"\",春季入力!G14)","v":""},{"$f":"IF(春季入力!D14=\"\",\"\",春季入力!D14)","v":""},{"$f":"IF(春季入力!G14=\"\",\"\",春季入力!G14)","v":""},"",{"$f":"IF(春季入力!P14=\"\",\"\",春季入力!P14)","v":""},{"$f":"IF(春季入力!E14=\"\",\"\",春季入力!E14)","v":""},{"$f":"IF(E4=\"\",\"\",VLOOKUP($E4,部員名簿!$A$5:$R$103,17,FALSE))","v":""},{"$f":"IF(E4=\"\",\"\",VLOOKUP($E4,部員名簿!$A$5:$R$103,17,FALSE))","v":""},null,{"$f":"IF(E4=\"\",\"\",VLOOKUP($E4,部員名簿!$A$5:$G$103,2,FALSE))","v":""},{"$f":"IF(春季入力!H14=\"\",\"\",春季入力!H14)","v":""},null,"","",{"$f":"IF(春季入力!I14=\"\",\"\",春季入力!I14)","v":""},null,"",""]
[null,{"$f":"IF(E5=\"\",\"\",必ずお読み下さい!$G$10)","v":""},null,null,{"$f":"IF(春季入力!C15=\"\",\"\",春季入力!C15)","v":""},{"$f":"IF(春季入力!D15=\"\",\"\",春季入力!D15)","v":""},{"$f":"IF(春季入力!G15=\"\",\"\",春季入力!G15)","v":""},{"$f":"IF(春季入力!D15=\"\",\"\",春季入力!D15)","v":""},{"$f":"IF(春季入力!G15=\"\",\"\",春季入力!G15)","v":""},"",{"$f":"IF(春季入力!P15=\"\",\"\",春季入力!P15)","v":""},{"$f":"IF(春季入力!E15=\"\",\"\",春季入力!E15)","v":""},{"$f":"IF(E5=\"\",\"\",VLOOKUP($E5,部員名簿!$A$5:$R$103,17,FALSE))","v":""},{"$f":"IF(E5=\"\",\"\",VLOOKUP($E5,部員名簿!$A$5:$R$103,17,FALSE))","v":""},null,{"$f":"IF(E5=\"\",\"\",VLOOKUP($E5,部員名簿!$A$5:$G$103,2,FALSE))","v":""},{"$f":"IF(春季入力!H15=\"\",\"\",春季入力!H15)","v":""},null,"","",{"$f":"IF(春季入力!I15=\"\",\"\",春季入力!I15)","v":""},null,"",""]
[null,{"$f":"IF(E6=\"\",\"\",必ずお読み下さい!$G$10)","v":""},null,null,{"$f":"IF(春季入力!C16=\"\",\"\",春季入力!C16)","v":""},{"$f":"IF(春季入力!D16=\"\",\"\",春季入力!D16)","v":""},{"$f":"IF(春季入力!G16=\"\",\"\",春季入力!G16)","v":""},{"$f":"IF(春季入力!D16=\"\",\"\",春季入力!D16)","v":""},{"$f":"IF(春季入力!G16=\"\",\"\",春季入力!G16)","v":""},"",{"$f":"IF(春季入力!P16=\"\",\"\",春季入力!P16)","v":""},{"$f":"IF(春季入力!E16=\"\",\"\",春季入力!E16)","v":""},{"$f":"IF(E6=\"\",\"\",VLOOKUP($E6,部員名簿!$A$5:$R$103,17,FALSE))","v":""},{"$f":"IF(E6=\"\",\"\",VLOOKUP($E6,部員名簿!$A$5:$R$103,17,FALSE))","v":""},null,{"$f":"IF(E6=\"\",\"\",VLOOKUP($E6,部員名簿!$A$5:$G$103,2,FALSE))","v":""},{"$f":"IF(春季入力!H16=\"\",\"\",春季入力!H16)","v":""},null,"","",{"$f":"IF(春季入力!I16=\"\",\"\",春季入力!I16)","v":""},null,"",""]
{"$rows_left_out":65}
{"sheet":"競技者マスタ（上陸）","index":10,"n_rows":37,"n_cols":21,"rows_kept":37,"cut":false,"hidden":false,"merged":[]}
["男子",null,null,null,null,null,null,"女子"]
["ナンバー","競技者名","競技者名（カナ）","学年","所属","所属（カナ）",null,"ナンバー","競技者名","競技者名（カナ）","学年","所属","所属（カナ）",null,null,1,"秋田東",740,"秋田市立秋田東中学校","東","ﾋｶﾞｼ"]
[{"$f":"IF(春季入力!C12=\"\",\"\",春季入力!C12)","v":""},{"$f":"IF(春季入力!D12=\"\",\"\",春季入力!D12)","v":""},{"$f":"IF(春季入力!G12=\"\",\"\",春季入力!G12)","v":""},{"$f":"IF(春季入力!E12=\"\",\"\",春季入力!E12)","v":""},{"$f":"IF(春季入力!B12=\"\",\"\",春季入力!B12)","v":""},{"$f":"IF(E3=\"\",\"\",VLOOKUP(E3,$T$2:$U$34,2,FALSE))","v":""},null,{"$f":"IF(春季入力!C71=\"\",\"\",春季入力!C71)","v":""},{"$f":"IF(春季入力!D71=\"\",\"\",春季入力!D71)","v":""},{"$f":"IF(春季入力!G71=\"\",\"\",春季入力!G71)","v":""},{"$f":"IF(春季入力!E71=\"\",\"\",春季入力!E71)","v":""},{"$f":"IF(春季入力!B71=\"\",\"\",春季入力!B71)","v":""},{"$f":"IF(L3=\"\",\"\",VLOOKUP(L3,$T$2:$U$33,2,FALSE))","v":""},null,null,2,"秋田南",741,"秋田市立秋田南中学校","南","ﾐﾅﾐ"]
[{"$f":"IF(春季入力!C13=\"\",\"\",春季入力!C13)","v":""},{"$f":"IF(春季入力!D13=\"\",\"\",春季入力!D13)","v":""},{"$f":"IF(春季入力!G13=\"\",\"\",春季入力!G13)","v":""},{"$f":"IF(春季入力!E13=\"\",\"\",春季入力!E13)","v":""},{"$f":"IF(春季入力!B13=\"\",\"\",春季入力!B13)","v":""},{"$f":"IF(E4=\"\",\"\",VLOOKUP(E4,$T$2:$U$34,2,FALSE))","v":""},null,{"$f":"IF(春季入力!C72=\"\",\"\",春季入力!C72)","v":""},{"$f":"IF(春季入力!D72=\"\",\"\",春季入力!D72)","v":""},{"$f":"IF(春季入力!G72=\"\",\"\",春季入力!G72)","v":""},{"$f":"IF(春季入力!E72=\"\",\"\",春季入力!E72)","v":""},{"$f":"IF(春季入力!B72=\"\",\"\",春季入力!B72)","v":""},{"$f":"IF(L4=\"\",\"\",VLOOKUP(L4,$T$2:$U$33,2,FALSE))","v":""},null,null,3,"山王",742,"秋田市立山王中学校","山王","ｻﾝﾉｳ"]
[{"$f":"IF(春季入力!C14=\"\",\"\",春季入力!C14)","v":""},{"$f":"IF(春季入力!D14=\"\",\"\",春季入力!D14)","v":""},{"$f":"IF(春季入力!G14=\"\",\"\",春季入力!G14)","v":""},{"$f":"IF(春季入力!E14=\"\",\"\",春季入力!E14)","v":""},{"$f":"IF(春季入力!B14=\"\",\"\",春季入力!B14)","v":""},"",null,{"$f":"IF(春季入力!C73=\"\",\"\",春季入力!C73)","v":""},{"$f":"IF(春季入力!D73=\"\",\"\",春季入力!D73)","v":""},{"$f":"IF(春季入力!G73=\"\",\"\",春季入力!G73)","v":""},{"$f":"IF(春季入力!E73=\"\",\"\",春季入力!E73)","v":""},{"$f":"IF(春季入力!B73=\"\",\"\",春季入力!B73)","v":""},"",null,null,4,"土崎",743,"秋田市立土崎中学校","土崎","ﾂﾁｻﾞｷ"]
[{"$f":"IF(春季入力!C15=\"\",\"\",春季入力!C15)","v":""},{"$f":"IF(春季入力!D15=\"\",\"\",春季入力!D15)","v":""},{"$f":"IF(春季入力!G15=\"\",\"\",春季入力!G15)","v":""},{"$f":"IF(春季入力!E15=\"\",\"\",春季入力!E15)","v":""},{"$f":"IF(春季入力!B15=\"\",\"\",春季入力!B15)","v":""},"",null,{"$f":"IF(春季入力!C74=\"\",\"\",春季入力!C74)","v":""},{"$f":"IF(春季入力!D74=\"\",\"\",春季入力!D74)","v":""},{"$f":"IF(春季入力!G74=\"\",\"\",春季入力!G74)","v":""},{"$f":"IF(春季入力!E74=\"\",\"\",春季入力!E74)","v":""},{"$f":"IF(春季入力!B74=\"\",\"\",春季入力!B74)","v":""},"",null,null,5,"将軍野",744,"秋田市立将軍野中学校","将軍野","ｼｮｳｸﾞﾝﾉ"]
{"$rows_left_out":32}
{"sheet":"男子一覧(手書用)","index":11,"n_rows":60,"n_cols":45,"rows_kept":60,"cut":false,"hidden":false,"merged":[[42,11,42,17],[54,0,54,23],[36,19,36,23],[37,19,37,23],[38,19,38,23],[39,19,39,23],[47,8,47,9],[47,10,47,15],[51,2,51,4],[51,7,51,11],[55,2,56,3],[53,0,53,18],[43,0,43,11],[45,1,45,17],[51,12,51,16],[47,1,47,6],[47,16,47,17],[34,19,34,23],[35,19,35,23],[28,19,28,23],[29,19,29,23],[30,19,30,23],[31,19,31,23],[32,19,32,23],[33,19,33,23],[27,19,27,23],[16,19,16,23],[17,19,17,23],[18,19,18,23],[19,19,19,23],[20,19,20,23],[21,19,21,23],[22,19,22,23],[23,19,23,23],[24,19,24,23],[25,19,25,23],[26,19,26,23],[15,19,15,23],[4,19,4,23],[5,19,5,23],[6,19,6,23],[7,19,7,23],[8,19,8,23],[9,19,9,23],[10,19,10,23],[11,19,11,23],[12,19,12,23],[13,19,13,23],[14,19,14,23],[1,25,2,25],[3,20,3,21],[3,22,3,23],[1,0,1,18],[2,2,2,9],[3,2,3,9],[3,11,3,14],[3,15,3,16]]}
[]
[{"$f":"男一覧!A2","v":"令和 7年度　秋田市中学校春季陸上競技大会　参加申込書一覧〔男子〕"}]
[null,"学校名(",null,null,null,null,null,null,null,null,")"]
[null,"監督名(",null,null,null,null,null,null,null,null,")","参加人数(",null,null,null,null,null,")名"]
["ナンバー\nカード","氏　　名","フリガナ","学年","２年\n100","３年\n100","共通\n200","共通\n400","共通\n800","共通\n1500","共通\n3000","共通\n110H","共通\n走高","共通\n棒高","共通\n走幅","共通\n砲丸",null,"共通\n400R",null,"個人情報の記載"]
[null,null,null,null,null,null,null,null,null,null,null,null,null,null,null,null,null,null,null,null,null,null,null,null,null,null,null,null,null,null,null,null,null,null,null,null,null,null,null,null,null,null,null,null,"○"]
{"$rows_left_out":55}
{"sheet":"女子一覧(手書用)","index":12,"n_rows":59,"n_cols":45,"rows_kept":59,"cut":false,"hidden":false,"merged":[[37,9,37,15],[40,1,40,15],[42,7,42,8],[42,9,42,13],[38,0,38,9],[42,1,42,6],[42,14,42,15],[49,0,49,20],[50,2,51,3],[48,0,48,20],[46,2,46,4],[46,6,46,10],[46,11,46,15],[21,17,21,20],[22,17,22,20],[23,17,23,20],[34,17,34,20],[28,17,28,20],[29,17,29,20],[30,17,30,20],[31,17,31,20],[25,17,25,20],[26,17,26,20],[27,17,27,20],[32,17,32,20],[33,17,33,20],[24,17,24,20],[7,17,7,20],[8,17,8,20],[9,17,9,20],[10,17,10,20],[15,17,15,20],[19,17,19,20],[20,17,20,20],[17,17,17,20],[18,17,18,20],[11,17,11,20],[12,17,12,20],[13,17,13,20],[14,17,14,20],[16,17,16,20],[1,0,1,16],[4,17,4,20],[5,17,5,20],[6,17,6,20],[2,2,2,8],[3,2,3,8],[3,13,3,14],[3,10,3,12],[3,15,3,16]]}
[]
[{"$f":"女一覧!A2","v":"令和 7年度　秋田市中学校春季陸上競技大会　参加申込書一覧〔女子〕"}]
[null,"学校名(",null,null,null,null,null,null,null,")"]
[null,"監督名(",null,null,null,null,null,null,null,")","参加人数(",null,null,null,null,")名"]
["ナンバー\nカード","氏    名","フリガナ","学年","２年\n100","３年\n100","共通\n200","共通\n800","２年\n1500","３年\n1500","共通\n100H","共通\n走高","共通\n走幅","共通\n砲丸",null,"共通\n400R",null,"個人情報の記載"]
[null,null,null,null,null,null,null,null,null,null,null,null,null,null,null,null,null,null,null,null,null,null,null,null,null,null,null,null,null,null,null,null,null,null,null,null,null,null,null,null,null,null,null,null,"○"]
{"$rows_left_out":54}
{"sheet":"個人個票(手書用)","index":13,"n_rows":43,"n_cols":11,"rows_kept":43,"cut":false,"hidden":false,"merged":[[29,0,29,1],[17,0,17,1],[25,0,25,1],[1,0,2,1],[3,0,3,1],[5,0,5,1],[7,0,7,1],[21,0,21,1],[9,0,9,1],[13,0,13,1],[23,0,23,1],[19,0,19,1],[11,0,11,1],[27,0,27,1],[15,0,15,1],[31,0,31,1],[41,0,41,1],[33,0,33,1],[35,0,35,1],[37,0,37,1],[39,0,39,1]]}
[]
["個人種目個票",null,null,null,null,"個人種目個票は２ページになります。"]
[null,null,null,null,null,"１ページ目は男子用、２ページ目は女子用です。"]
["種　　　目",null,"組","ﾚｰﾝ・順","ナンバーカード","名　　　　前","学　　校","学年","ベスト記録","個人情報の掲載"]
["男",null,null,null,null,null,null,null,null,null,1]
["種　　　目",null,"組","ﾚｰﾝ・順","ナンバーカード","名　　　　前","学　　校","学年","ベスト記録","個人情報の掲載"]
{"$rows_left_out":38}
{"sheet":"リレー個票(手書用)","index":14,"n_rows":23,"n_cols":8,"rows_kept":23,"cut":false,"hidden":false,"merged":[[20,3,25,3],[20,7,25,7],[0,4,0,6],[6,7,11,7],[6,3,11,3],[22,0,23,0],[1,0,2,0],[6,1,11,1],[6,2,11,2],[20,1,25,1],[20,2,25,2],[8,0,9,0],[15,0,16,0]]}
[null,null,null,null,"\nリレー個票は男女一緒に印刷されます。"]
["男子"]
[]
[]
[]
["種　　　目","組","レーン","学校名","ナンバーカード","名　　　前","学年","ベスト記録"]
{"$rows_left_out":17}