{"text_format":"1","workbook":"xlsx","n_sheets":11,"sheets":["必ずお読み下さい","新人入力","男一覧","女一覧","男個票","女個票","ﾘﾚｰ個票","部員名簿","登録データ貼付","競技者マスタ（nans）","競技者マスタ（上陸）"],"not_rendered":{"charts":0,"images":0,"macros":1,"external_links":0,"defined_names":7,"comments":0,"pivot_tables":0},"unopened":[],"bounds":{"document_bytes":16777216,"sheet_cells":100000,"rows_first":2000,"rows_last":500,"rows_between":2000,"halvings":0,"cell_chars":16384,"cell_head_chars":4096},"cells_cut":0,"cells_raw":0,"read":"whole","date_system":"1900"}

{"sheet":"必ずお読み下さい","index":0,"n_rows":44,"n_cols":9,"rows_kept":44,"cut":false,"hidden":false,"merged":[[0,0,0,2]]}
["必ず全部読んで下さい！"]
["市秋季大会申込書の作成について"]
[]
[null,"最初に"]
[null,null,"　部員名簿は、日本陸連への登録データのファイルからコピー・貼り付けで完成するようにしました。\n　なお、八橋もnansのシステムが入りましたので，入力したこのファイルは提出して頂くことになります。学校名を入れて桜中 伊藤賢悦まで提出をお願いします。"]
[]
{"$rows_left_out":39}
{"sheet":"新人入力","index":1,"n_rows":174,"n_cols":23,"rows_kept":174,"cut":false,"hidden":false,"merged":[[81,1,82,1],[77,2,77,3],[77,11,77,12],[81,11,83,12],[82,5,83,5],[5,1,6,1],[1,2,1,3],[1,11,1,12],[5,11,7,12],[6,5,7,5]]}
["市新人男子"]
[null,null,"一覧表用データ",null,null,null,null,null,null,null,null,"個表用データ"]
[null,null,"学校名",{"$f":"IF(必ずお読み下さい!H9=\"\",\"\",必ずお読み下さい!H9)","v":""},null,null,null,null,null,null,null,"学校名（略称）",{"$f":"IF(必ずお読み下さい!I9=\"\",\"\",必ずお読み下さい!I9)","v":""}]
[null,null,"監督氏名",null,"※"]
[null,null,"校長名",null,"※"]
[null,"引率・監督の特例を適用した場合入力→","引率者",null,null,null,null,null,null,null,null,"※の項目は必ず入力してください。\n入力の内容については「必ずお読み下さい」を参照して下さい。"]
{"$rows_left_out":169}
{"sheet":"男一覧","index":2,"n_rows":64,"n_cols":42,"rows_kept":64,"cut":false,"hidden":false,"merged":[[59,2,60,3],[0,0,0,19],[47,12,47,18],[2,12,2,15],[2,16,2,17],[2,18,2,19],[1,2,1,9],[2,2,2,9],[0,22,1,22],[56,2,56,5],[52,8,52,9],[56,7,56,11],[48,0,48,9],[56,12,56,17],[52,10,52,16],[50,1,50,18],[52,1,52,5]]}
["令和８年度　秋田市中学校秋季陸上競技大会　参加申込書一覧〔男子〕"]
[null,"学校名(",{"$f":"IF(B53=\"\",\"\",B53)","v":""},null,null,null,null,null,null,null,")"]
[null,"監督名(",{"$f":"IF(新人入力!D4=\"\",\"\",新人入力!D4)","v":""},null,null,null,null,null,null,null,")",null,"参加人数（",null,null,null,{"$f":"COUNTA(新人入力!B11:B51)","v":0},null,"）名"]
["ナンバー\nカード","氏　　名","フリガナ","学年","１年\n100","２年\n100","共通\n200","共通\n400","共通\n800","１年\n1500","２年\n1500","共通\n3000","共通\n110H","共通\n走高","共通\n棒高","共通\n走幅","共通\n砲丸",null,null,"共通\n400Ｒ"]
[{"$f":"IF(新人入力!B11=\"\",\"\",新人入力!B11)","v":""},{"$f":"IF(新人入力!D11=\"\",\"\",新人入力!D11)","v":""},{"$f":"IF(新人入力!F11=\"\",\"\",新人入力!F11)","v":""},{"$f":"IF(新人入力!E11=\"\",\"\",新人入力!E11)","v":""},{"$f":"IF(OR(新人入力!$H11=13,新人入力!$I11=13),\"○\",\"\")","v":""},{"$f":"IF(OR(新人入力!$H11=1,新人入力!$I11=1),\"○\",\"\")","v":""},{"$f":"IF(OR(新人入力!$H11=3,新人入力!$I11=3),\"○\",\"\")","v":""},{"$f":"IF(OR(新人入力!$H11=4,新人入力!$I11=4),\"○\",\"\")","v":""},{"$f":"IF(OR(新人入力!$H11=5,新人入力!$I11=5),\"○\",\"\")","v":""},{"$f":"IF(OR(新人入力!$H11=14,新人入力!$I11=14),\"○\",\"\")","v":""},{"$f":"IF(OR(新人入力!$H11=6,新人入力!$I11=6),\"○\",\"\")","v":""},{"$f":"IF(OR(新人入力!$H11=7,新人入力!$I11=7),\"○\",\"\")","v":""},{"$f":"IF(OR(新人入力!$H11=8,新人入力!$I11=8),\"○\",\"\")","v":""},{"$f":"IF(OR(新人入力!$H11=9,新人入力!$I11=9),\"○\",\"\")","v":""},{"$f":"IF(OR(新人入力!$H11=10,新人入力!$I11=10),\"○\",\"\")","v":""},{"$f":"IF(OR(新人入力!$H11=11,新人入力!$I11=11),\"○\",\"\")","v":""},{"$f":"IF(OR(新人入力!$H11=12,新人入力!$I11=12),\"○\",\"\")","v":""},null,null,{"$f":"IF(新人入力!J11=18,\"○\",\"\")","v":""},null,null,null,null,null,null,null,null,null,null,null,null,null,null,null,null,null,null,null,null,null,"○"]
[{"$f":"IF(新人入力!B12=\"\",\"\",新人入力!B12)","v":""},{"$f":"IF(新人入力!D12=\"\",\"\",新人入力!D12)","v":""},{"$f":"IF(新人入力!F12=\"\",\"\",新人入力!F12)","v":""},{"$f":"IF(新人入力!E12=\"\",\"\",新人入力!E12)","v":""},{"$f":"IF(OR(新人入力!$H12=13,新人入力!$I12=13),\"○\",\"\")","v":""},{"$f":"IF(OR(新人入力!$H12=1,新人入力!$I12=1),\"○\",\"\")","v":""},{"$f":"IF(OR(新人入力!$H12=3,新人入力!$I12=3),\"○\",\"\")","v":""},{"$f":"IF(OR(新人入力!$H12=4,新人入力!$I12=4),\"○\",\"\")","v":""},{"$f":"IF(OR(新人入力!$H12=5,新人入力!$I12=5),\"○\",\"\")","v":""},{"$f":"IF(OR(新人入力!$H12=14,新人入力!$I12=14),\"○\",\"\")","v":""},{"$f":"IF(OR(新人入力!$H12=6,新人入力!$I12=6),\"○\",\"\")","v":""},{"$f":"IF(OR(新人入力!$H12=7,新人入力!$I12=7),\"○\",\"\")","v":""},{"$f":"IF(OR(新人入力!$H12=8,新人入力!$I12=8),\"○\",\"\")","v":""},{"$f":"IF(OR(新人入力!$H12=9,新人入力!$I12=9),\"○\",\"\")","v":""},{"$f":"IF(OR(新人入力!$H12=10,新人入力!$I12=10),\"○\",\"\")","v":""},{"$f":"IF(OR(新人入力!$H12=11,新人入力!$I12=11),\"○\",\"\")","v":""},{"$f":"IF(OR(新人入力!$H12=12,新人入力!$I12=12),\"○\",\"\")","v":""},null,null,{"$f":"IF(新人入力!J12=18,\"○\",\"\")","v":""}]
{"$rows_left_out":59}
{"sheet":"女一覧","index":3,"n_rows":64,"n_cols":42,"rows_kept":64,"cut":false,"hidden":false,"merged":[[55,2,56,3],[44,0,44,9],[43,9,43,15],[46,1,46,15],[52,2,52,4],[48,6,48,7],[48,8,48,13],[52,6,52,9],[52,10,52,14],[48,1,48,4],[0,0,0,16],[2,9,2,12],[2,13,2,14],[2,15,2,16],[1,2,1,7],[2,2,2,7]]}
["令和８年度　秋田市中学校秋季陸上競技大会　参加申込書一覧〔女子〕"]
[null,"学校名(",{"$f":"IF(B49=\"\",\"\",B49)","v":""},null,null,null,null,null,"）"]
[null,"監督名(",{"$f":"IF(新人入力!D80=\"\",\"\",新人入力!D80)","v":""},null,null,null,null,null,"）","参加人数（",null,null,null,{"$f":"COUNTA(新人入力!B87:B123)","v":0},null,"）名"]
["ナンバー\nカード","氏    名","フリガナ","学年","１年\n100","２年\n100","共通\n200","共通\n800","１年\n1500","２年\n1500","共通\n100H","共通\n走高","共通\n走幅","共通\n砲丸",null,null,"共通\n400R"]
[{"$f":"IF(新人入力!B87=\"\",\"\",新人入力!B87)","v":""},{"$f":"IF(新人入力!D87=\"\",\"\",新人入力!D87)","v":""},{"$f":"IF(新人入力!F87=\"\",\"\",新人入力!F87)","v":""},{"$f":"IF(新人入力!E87=\"\",\"\",新人入力!E87)","v":""},{"$f":"IF(OR(新人入力!$H87=31,新人入力!$I87=31),\"○\",\"\")","v":""},{"$f":"IF(OR(新人入力!$H87=21,新人入力!$I87=21),\"○\",\"\")","v":""},{"$f":"IF(OR(新人入力!$H87=23,新人入力!$I87=23),\"○\",\"\")","v":""},{"$f":"IF(OR(新人入力!$H87=24,新人入力!$I87=24),\"○\",\"\")","v":""},{"$f":"IF(OR(新人入力!$H87=25,新人入力!$I87=25),\"○\",\"\")","v":""},{"$f":"IF(OR(新人入力!$H87=26,新人入力!$I87=26),\"○\",\"\")","v":""},{"$f":"IF(OR(新人入力!$H87=27,新人入力!$I87=27),\"○\",\"\")","v":""},{"$f":"IF(OR(新人入力!$H87=28,新人入力!$I87=28),\"○\",\"\")","v":""},{"$f":"IF(OR(新人入力!$H87=29,新人入力!$I87=29),\"○\",\"\")","v":""},{"$f":"IF(OR(新人入力!$H87=30,新人入力!$I87=30),\"○\",\"\")","v":""},null,null,{"$f":"IF(新人入力!$J87=38,\"○\",\"\")","v":""},{"$f":"IF(新人入力!N87=\"\",\"\",新人入力!N87)","v":""},null,null,null,null,null,null,null,null,null,null,null,null,null,null,null,null,null,null,null,null,null,null,null,"○"]
[{"$f":"IF(新人入力!B88=\"\",\"\",新人入力!B88)","v":""},{"$f":"IF(新人入力!D88=\"\",\"\",新人入力!D88)","v":""},{"$f":"IF(新人入力!F88=\"\",\"\",新人入力!F88)","v":""},{"$f":"IF(新人入力!E88=\"\",\"\",新人入力!E88)","v":""},{"$f":"IF(OR(新人入力!$H88=31,新人入力!$I88=31),\"○\",\"\")","v":""},{"$f":"IF(OR(新人入力!$H88=21,新人入力!$I88=21),\"○\",\"\")","v":""},{"$f":"IF(OR(新人入力!$H88=23,新人入力!$I88=23),\"○\",\"\")","v":""},{"$f":"IF(OR(新人入力!$H88=24,新人入力!$I88=24),\"○\",\"\")","v":""},{"$f":"IF(OR(新人入力!$H88=25,新人入力!$I88=25),\"○\",\"\")","v":""},{"$f":"IF(OR(新人入力!$H88=26,新人入力!$I88=26),\"○\",\"\")","v":""},{"$f":"IF(OR(新人入力!$H88=27,新人入力!$I88=27),\"○\",\"\")","v":""},{"$f":"IF(OR(新人入力!$H88=28,新人入力!$I88=28),\"○\",\"\")","v":""},{"$f":"IF(OR(新人入力!$H88=29,新人入力!$I88=29),\"○\",\"\")","v":""},{"$f":"IF(OR(新人入力!$H88=30,新人入力!$I88=30),\"○\",\"\")","v":""},null,null,{"$f":"IF(新人入力!$J88=38,\"○\",\"\")","v":""},{"$f":"IF(新人入力!N88=\"\",\"\",新人入力!N88)","v":""}]
{"$rows_left_out":59}
{"sheet":"男個票","index":4,"n_rows":86,"n_cols":42,"rows_kept":86,"cut":false,"hidden":false,"merged":[[66,0,66,1],[66,10,66,11],[62,0,62,1],[62,10,62,11],[64,0,64,1],[64,10,64,11],[58,0,58,1],[58,10,58,11],[60,0,60,1],[60,10,60,11],[54,0,54,1],[54,10,54,11],[56,0,56,1],[56,10,56,11],[50,0,50,1],[50,10,50,11],[52,0,52,1],[52,10,52,11],[46,0,46,1],[46,10,46,11],[48,0,48,1],[48,10,48,11],[42,0,42,1],[42,10,42,11],[44,0,44,1],[44,10,44,11],[38,0,38,1],[38,10,38,11],[40,0,40,1],[40,10,40,11],[34,0,34,1],[34,10,34,11],[36,0,36,1],[36,10,36,11],[30,0,30,1],[30,10,30,11],[32,0,32,1],[32,10,32,11],[26,0,26,1],[26,10,26,11],[28,0,28,1],[28,10,28,11],[22,0,22,1],[22,10,22,11],[24,0,24,1],[24,10,24,11],[20,10,20,11],[14,0,14,1],[14,10,14,11],[16,0,16,1],[16,10,16,11],[4,0,4,1],[4,10,4,11],[0,10,1,11],[0,0,1,1],[68,0,68,1],[10,0,10,1],[10,10,10,11],[12,0,12,1],[12,10,12,11],[6,0,6,1],[6,10,6,11],[8,0,8,1],[8,10,8,11],[18,0,18,1],[18,10,18,11],[20,0,20,1],[72,0,72,1],[74,0,74,1],[68,10,68,11],[70,10,70,11],[72,10,72,11],[74,10,74,11],[70,0,70,1],[76,0,76,1],[76,10,76,11],[78,0,78,1],[78,10,78,11],[84,0,84,1],[84,10,84,11],[80,0,80,1],[80,10,80,11],[82,0,82,1],[82,10,82,11]]}
["第一種目個票",null,null,null,null,null,null,null,null,null,"第二種目個票"]
[]
[]
[]
["種　　　目",null,"組","ﾚｰﾝ・順","ナンバーカード","名　　　　前","学　　校","学年","ベスト記録",null,"種　　　目",null,"組","ﾚｰﾝ・順","ナンバーカード","名　　　　前","学　　校","学年","ベスト記録",null,null,"個人種目１","個人種目２",null,13,1,3,4,5,14,6,7,8,9,10,11,12,14,15,16,17,18]
["男",{"$f":"IF(V6=\"\",\"\",HLOOKUP(V6,$Y$5:$AP$6,2,FALSE))","v":""},null,null,{"$f":"IF(男一覧!A5=\"\",\"\",男一覧!A5)","v":""},{"$f":"IF(男一覧!B5=\"\",\"\",男一覧!B5)","v":""},{"$f":"IF(F6=\"\",\"\",新人入力!$M$3)","v":""},{"$f":"IF(男一覧!D5=\"\",\"\",男一覧!D5)","v":""},null,1,"男",{"$f":"IF(W6=\"\",\"\",HLOOKUP(W6,$Y$5:$AP$6,2,FALSE))","v":""},null,null,{"$f":"IF(E6=\"\",\"\",E6)","v":""},{"$f":"IF(F6=\"\",\"\",F6)","v":""},{"$f":"IF(G6=\"\",\"\",G6)","v":""},{"$f":"IF(H6=\"\",\"\",H6)","v":""},null,null,1,{"$f":"IF(新人入力!H11=\"\",\"\",新人入力!H11)","v":""},{"$f":"IF(新人入力!I11=\"\",\"\",新人入力!I11)","v":""},null,"１年\n100","２年\n100","共通\n200","共通\n400","共通\n800","１年\n1500","２年\n1500","共通\n3000","共通\n110H","共通\n走高","共通\n棒高","共通\n走幅","共通\n砲丸"]
{"$rows_left_out":81}
{"sheet":"女個票","index":5,"n_rows":78,"n_cols":39,"rows_kept":78,"cut":false,"hidden":false,"merged":[[66,0,66,1],[66,10,66,11],[62,0,62,1],[62,10,62,11],[64,0,64,1],[64,10,64,11],[58,0,58,1],[58,10,58,11],[60,0,60,1],[60,10,60,11],[54,0,54,1],[54,10,54,11],[56,0,56,1],[56,10,56,11],[50,0,50,1],[50,10,50,11],[52,0,52,1],[52,10,52,11],[46,0,46,1],[46,10,46,11],[48,0,48,1],[48,10,48,11],[42,0,42,1],[42,10,42,11],[44,0,44,1],[44,10,44,11],[38,0,38,1],[38,10,38,11],[40,0,40,1],[40,10,40,11],[34,0,34,1],[34,10,34,11],[36,0,36,1],[36,10,36,11],[30,0,30,1],[30,10,30,11],[32,0,32,1],[32,10,32,11],[26,0,26,1],[26,10,26,11],[28,0,28,1],[28,10,28,11],[22,0,22,1],[22,10,22,11],[24,0,24,1],[24,10,24,11],[0,0,1,1],[0,10,1,11],[6,0,6,1],[6,10,6,11],[8,0,8,1],[8,10,8,11],[4,0,4,1],[4,10,4,11],[10,0,10,1],[10,10,10,11],[68,0,68,1],[68,10,68,11],[70,0,70,1],[70,10,70,11],[12,0,12,1],[12,10,12,11],[18,0,18,1],[18,10,18,11],[20,0,20,1],[20,10,20,11],[14,0,14,1],[14,10,14,11],[16,0,16,1],[16,10,16,11],[76,0,76,1],[76,10,76,11],[72,0,72,1],[72,10,72,11],[74,0,74,1],[74,10,74,11]]}
["第一種目個票",null,null,null,null,null,null,null,null,null,"第二種目個票"]
[]
[]
[]
["種　　　目",null,"組","ﾚｰﾝ・順","ナンバーカード","名　　　　前","学　　校","学年","ベスト記録",null,"種　　　目",null,"組","ﾚｰﾝ・順","ナンバーカード","名　　　　前","学　　校","学年","ベスト記録",null,null,"個人種目１","個人種目２",null,31,21,23,24,25,26,27,28,29,30,11,12,13,14,15]
["女",{"$f":"IF(V6=\"\",\"\",HLOOKUP(V6,$Y$5:$AP$6,2,FALSE))","v":""},null,null,{"$f":"IF(新人入力!B87=\"\",\"\",新人入力!B87)","v":""},{"$f":"IF(女一覧!B5=\"\",\"\",女一覧!B5)","v":""},{"$f":"IF(F6=\"\",\"\",新人入力!$M$3)","v":""},{"$f":"IF(女一覧!D5=\"\",\"\",女一覧!D5)","v":""},null,1,"女",{"$f":"IF(W6=\"\",\"\",HLOOKUP(W6,$Y$5:$AP$6,2,FALSE))","v":""},null,null,{"$f":"IF(E6=\"\",\"\",E6)","v":""},{"$f":"IF(F6=\"\",\"\",F6)","v":""},{"$f":"IF(G6=\"\",\"\",G6)","v":""},{"$f":"IF(H6=\"\",\"\",H6)","v":""},null,null,1,{"$f":"IF(新人入力!H87=\"\",\"\",新人入力!H87)","v":""},{"$f":"IF(新人入力!I87=\"\",\"\",新人入力!I87)","v":""},null,"１年\n100","２年\n100","共通\n200","共通\n800","１年\n1500","２年\n1500","共通\n100H","共通\n走高","共通\n走幅","共通\n砲丸"]
{"$rows_left_out":73}
{"sheet":"ﾘﾚｰ個票","index":6,"n_rows":40,"n_cols":8,"rows_kept":40,"cut":false,"hidden":false,"merged":[[0,0,1,0],[24,0,25,0],[7,0,8,0],[18,0,19,0],[5,7,10,7],[16,7,21,7],[29,7,34,7],[40,2,45,2],[40,3,45,3],[29,1,34,1],[40,7,45,7],[29,2,34,2],[29,3,34,3],[42,0,43,0],[40,1,45,1],[16,3,21,3],[31,0,32,0],[5,1,10,1],[5,2,10,2],[5,3,10,3],[16,1,21,1],[16,2,21,2]]}
["男子"]
[]
[]
[]
["種　　　目","組","レーン","学校名","ナンバーカード","名　　　前","学年","ベスト記録"]
[null,null,null,{"$f":"IF(必ずお読み下さい!I9=\"\",\"\",必ずお読み下さい!I9)","v":""},{"$f":"IF(新人入力!B58=\"\",\"\",新人入力!B58)","v":""},{"$f":"IF(新人入力!D58=\"\",\"\",新人入力!D58)","v":""},{"$f":"IF(新人入力!E58=\"\",\"\",新人入力!E58)","v":""}]
{"$rows_left_out":35}
{"sheet":"部員名簿","index":7,"n_rows":103,"n_cols":29,"rows_kept":103,"cut":false,"hidden":false,"merged":[[4,24,4,25]]}
["部員名簿（通年ナンバー）一覧"]
[{"$f":"VLOOKUP(W5,U8:AA34,6,FALSE)","v":{"$error":"#N/A"}}]
[]
["通年ナンバー","JAAF ID","氏　名","フリガナ","氏名英語表記","学年","性別",null,null,null,"氏名","フリガナ","ﾌﾘｶﾞﾅ","英字","学年","性別","生年月日"]
[{"$f":"IF(登録データ貼付!E2=\"\",\"\",登録データ貼付!E2)","v":""},{"$f":"IF(登録データ貼付!B2=\"\",\"\",登録データ貼付!B2)","v":""},{"$f":"IF(K5=\"\",\"\",K5)","v":""},{"$f":"IF(M5=\"\",\"\",M5)","v":""},{"$f":"IF(N5=\"\",\"\",N5)","v":""},{"$f":"IF(O5=\"\",\"\",O5)","v":""},{"$f":"IF(P5=\"\",\"\",P5)","v":""},null,null,null,{"$f":"IF(登録データ貼付!C2=\"\",\"\",登録データ貼付!C2&\"　\"&登録データ貼付!D2)","v":""},{"$f":"IF(登録データ貼付!F2=\"\",\"\",登録データ貼付!F2&\"　\"&登録データ貼付!G2)","v":""},{"$f":"ASC(L5)","v":""},{"$f":"IF(登録データ貼付!H2=\"\",\"\",登録データ貼付!H2&\" \"&登録データ貼付!I2)","v":""},{"$f":"IF(登録データ貼付!V2=\"\",\"\",RIGHT(登録データ貼付!V2,1))","v":""},{"$f":"IF(登録データ貼付!K2=\"\",\"\",LEFT(登録データ貼付!K2,1))","v":""},{"$f":"IF(登録データ貼付!S2=\"\",\"\",登録データ貼付!S2)","v":""},null,null,"01",null,"学校名",{"$f":"IF(必ずお読み下さい!G9=\"\",\"\",必ずお読み下さい!G9)","v":29}]
[{"$f":"IF(登録データ貼付!E3=\"\",\"\",登録データ貼付!E3)","v":""},{"$f":"IF(登録データ貼付!B3=\"\",\"\",登録データ貼付!B3)","v":""},{"$f":"IF(K6=\"\",\"\",K6)","v":""},{"$f":"IF(M6=\"\",\"\",M6)","v":""},{"$f":"IF(N6=\"\",\"\",N6)","v":""},{"$f":"IF(O6=\"\",\"\",O6)","v":""},{"$f":"IF(P6=\"\",\"\",P6)","v":""},null,null,null,{"$f":"IF(登録データ貼付!C3=\"\",\"\",登録データ貼付!C3&\"　\"&登録データ貼付!D3)","v":""},{"$f":"IF(登録データ貼付!F3=\"\",\"\",登録データ貼付!F3&\"　\"&登録データ貼付!G3)","v":""},{"$f":"ASC(L6)","v":""},{"$f":"IF(登録データ貼付!H3=\"\",\"\",登録データ貼付!H3&\" \"&登録データ貼付!I3)","v":""},{"$f":"IF(登録データ貼付!V3=\"\",\"\",RIGHT(登録データ貼付!V3,1))","v":""},{"$f":"IF(登録データ貼付!K3=\"\",\"\",LEFT(登録データ貼付!K3,1))","v":""},{"$f":"IF(登録データ貼付!S3=\"\",\"\",登録データ貼付!S3)","v":""},null,null,"02",null,"学校コード",{"$f":"IF(W5=\"\",\"\",VLOOKUP(W5,U8:Y103,5,FALSE))","v":{"$error":"#N/A"}}]
{"$rows_left_out":98}
{"sheet":"登録データ貼付","index":8,"n_rows":1,"n_cols":43,"rows_kept":1,"cut":false,"hidden":false,"merged":[]}
["年度","JAAF ID","氏名（姓）","氏名（名）","登録番号","フリガナ（姓）","フリガナ（名）","英字（姓）","英字（名）","国籍","性別","登録都道府県番号","登録都道府県名","団体UID","団体ID","団体名","団体名略称1","団体名略称2","生年月日","旧団体コード","備考","学年","団体区分","承認団体名","郵便番号","住所","携帯電話番号","卒業高校名","卒業中学名","メールアドレス","E-mail配信希望","勤務先名","勤務先郵便番号","勤務先都道府県","勤務先市区町村 / 番地 / 建物名","在籍学校都道府県","障がいのクラス","実施している種目","興味がある種目","指導者チェック","役職名","管理者","状態"]

{"sheet":"競技者マスタ（nans）","index":9,"n_rows":81,"n_cols":36,"rows_kept":81,"cut":false,"hidden":false,"merged":[]}
["競技者NO","所属コード1","所属コード2","ナンバー","ナンバー2","競技者名","競技者名カナ","競技者名略称","競技者名英字","国籍","性別","学年","生年","月日","個人所属地名","陸連コード","参加競技-競技コード1","参加競技-自己記録1","参加競技-オープン参加FLG1","参加競技-記録FLG1","参加競技-競技コード2","参加競技-自己記録2","参加競技-オープン参加FLG2","参加競技-記録FLG2","参加競技-競技コード3","参加競技-自己記録3","参加競技-オープン参加FLG3","参加競技-記録FLG3","参加競技-競技コード4","参加競技-自己記録4","参加競技-オープン参加FLG4","参加競技-記録FLG4","参加競技-競技コード5","参加競技-自己記録5","参加競技-オープン参加FLG5","参加競技-記録FLG5"]
[null,{"$f":"IF(E2=\"\",\"\",部員名簿!$W$5)","v":""},null,null,{"$f":"IF(新人入力!B11=\"\",\"\",新人入力!B11)","v":""},{"$f":"IF(新人入力!D11=\"\",\"\",新人入力!D11)","v":""},{"$f":"IF(新人入力!F11=\"\",\"\",新人入力!F11)","v":""},{"$f":"IF(F2=\"\",\"\",F2)","v":""},{"$f":"IF(新人入力!G11=\"\",\"\",新人入力!G11)","v":""},{"$f":"IF(E2=\"\",\"\",\"JPN\")","v":""},{"$f":"IF(E2=\"\",\"\",1)","v":""},{"$f":"IF(新人入力!E11=\"\",\"\",新人入力!E11)","v":""},{"$f":"IF(E2=\"\",\"\",VLOOKUP($E2,部員名簿!$A$5:$R$103,17,FALSE))","v":""},{"$f":"IF(E2=\"\",\"\",VLOOKUP($E2,部員名簿!$A$5:$R$103,17,FALSE))","v":""},null,{"$f":"IF(E2=\"\",\"\",VLOOKUP($E2,部員名簿!$A$5:$G$103,2,FALSE))","v":""},{"$f":"IF(新人入力!H11=\"\",\"\",新人入力!H11)","v":""},null,{"$f":"IF(Q2=\"\",\"\",0)","v":""},{"$f":"IF(Q2=\"\",\"\",0)","v":""},{"$f":"IF(新人入力!I11=\"\",\"\",新人入力!I11)","v":""},null,{"$f":"IF(U2=\"\",\"\",0)","v":""},{"$f":"IF(U2=\"\",\"\",0)","v":""},{"$f":"IF(新人入力!J11=\"\",\"\",新人入力!J11)","v":""},null,{"$f":"IF(Y2=\"\",\"\",0)","v":""},{"$f":"IF(Y2=\"\",\"\",0)","v":""}]
[null,{"$f":"IF(E3=\"\",\"\",部員名簿!$W$5)","v":""},null,null,{"$f":"IF(新人入力!B12=\"\",\"\",新人入力!B12)","v":""},{"$f":"IF(新人入力!D12=\"\",\"\",新人入力!D12)","v":""},{"$f":"IF(新人入力!F12=\"\",\"\",新人入力!F12)","v":""},{"$f":"IF(F3=\"\",\"\",F3)","v":""},{"$f":"IF(新人入力!G12=\"\",\"\",新人入力!G12)","v":""},{"$f":"IF(E3=\"\",\"\",\"JPN\")","v":""},{"$f":"IF(E3=\"\",\"\",1)","v":""},{"$f":"IF(新人入力!E12=\"\",\"\",新人入力!E12)","v":""},{"$f":"IF(E3=\"\",\"\",VLOOKUP($E3,部員名簿!$A$5:$R$103,17,FALSE))","v":""},{"$f":"IF(E3=\"\",\"\",VLOOKUP($E3,部員名簿!$A$5:$R$103,17,FALSE))","v":""},null,{"$f":"IF(E3=\"\",\"\",VLOOKUP($E3,部員名簿!$A$5:$G$103,2,FALSE))","v":""},{"$f":"IF(新人入力!H12=\"\",\"\",新人入力!H12)","v":""},null,{"$f":"IF(Q3=\"\",\"\",0)","v":""},{"$f":"IF(Q3=\"\",\"\",0)","v":""},{"$f":"IF(新人入力!I12=\"\",\"\",新人入力!I12)","v":""},null,{"$f":"IF(U3=\"\",\"\",0)","v":""},{"$f":"IF(U3=\"\",\"\",0)","v":""},{"$f":"IF(新人入力!J12=\"\",\"\",新人入力!J12)","v":""},null,{"$f":"IF(Y3=\"\",\"\",0)","v":""},{"$f":"IF(Y3=\"\",\"\",0)","v":""}]
[null,{"$f":"IF(E4=\"\",\"\",部員名簿!$W$5)","v":""},null,null,{"$f":"IF(新人入力!B13=\"\",\"\",新人入力!B13)","v":""},{"$f":"IF(新人入力!D13=\"\",\"\",新人入力!D13)","v":""},{"$f":"IF(新人入力!F13=\"\",\"\",新人入力!F13)","v":""},"",{"$f":"IF(新人入力!G13=\"\",\"\",新人入力!G13)","v":""},"","",{"$f":"IF(新人入力!E13=\"\",\"\",新人入力!E13)","v":""},{"$f":"IF(E4=\"\",\"\",VLOOKUP($E4,部員名簿!$A$5:$R$103,17,FALSE))","v":""},{"$f":"IF(E4=\"\",\"\",VLOOKUP($E4,部員名簿!$A$5:$R$103,17,FALSE))","v":""},null,{"$f":"IF(E4=\"\",\"\",VLOOKUP($E4,部員名簿!$A$5:$G$103,2,FALSE))","v":""},{"$f":"IF(新人入力!H13=\"\",\"\",新人入力!H13)","v":""},null,"","",{"$f":"IF(新人入力!I13=\"\",\"\",新人入力!I13)","v":""},null,"","",{"$f":"IF(新人入力!J13=\"\",\"\",新人入力!J13)","v":""},null,"",""]
[null,{"$f":"IF(E5=\"\",\"\",部員名簿!$W$5)","v":""},null,null,{"$f":"IF(新人入力!B14=\"\",\"\",新人入力!B14)","v":""},{"$f":"IF(新人入力!D14=\"\",\"\",新人入力!D14)","v":""},{"$f":"IF(新人入力!F14=\"\",\"\",新人入力!F14)","v":""},"",{"$f":"IF(新人入力!G14=\"\",\"\",新人入力!G14)","v":""},"","",{"$f":"IF(新人入力!E14=\"\",\"\",新人入力!E14)","v":""},{"$f":"IF(E5=\"\",\"\",VLOOKUP($E5,部員名簿!$A$5:$R$103,17,FALSE))","v":""},{"$f":"IF(E5=\"\",\"\",VLOOKUP($E5,部員名簿!$A$5:$R$103,17,FALSE))","v":""},null,{"$f":"IF(E5=\"\",\"\",VLOOKUP($E5,部員名簿!$A$5:$G$103,2,FALSE))","v":""},{"$f":"IF(新人入力!H14=\"\",\"\",新人入力!H14)","v":""},null,"","",{"$f":"IF(新人入力!I14=\"\",\"\",新人入力!I14)","v":""},null,"","",{"$f":"IF(新人入力!J14=\"\",\"\",新人入力!J14)","v":""},null,"",""]
[null,{"$f":"IF(E6=\"\",\"\",部員名簿!$W$5)","v":""},null,null,{"$f":"IF(新人入力!B15=\"\",\"\",新人入力!B15)","v":""},{"$f":"IF(新人入力!D15=\"\",\"\",新人入力!D15)","v":""},{"$f":"IF(新人入力!F15=\"\",\"\",新人入力!F15)","v":""},"",{"$f":"IF(新人入力!G15=\"\",\"\",新人入力!G15)","v":""},"","",{"$f":"IF(新人入力!E15=\"\",\"\",新人入力!E15)","v":""},{"$f":"IF(E6=\"\",\"\",VLOOKUP($E6,部員名簿!$A$5:$R$103,17,FALSE))","v":""},{"$f":"IF(E6=\"\",\"\",VLOOKUP($E6,部員名簿!$A$5:$R$103,17,FALSE))","v":""},null,{"$f":"IF(E6=\"\",\"\",VLOOKUP($E6,部員名簿!$A$5:$G$103,2,FALSE))","v":""},{"$f":"IF(新人入力!H15=\"\",\"\",新人入力!H15)","v":""},null,"","",{"$f":"IF(新人入力!I15=\"\",\"\",新人入力!I15)","v":""},null,"","",{"$f":"IF(新人入力!J15=\"\",\"\",新人入力!J15)","v":""},null,"",""]
{"$rows_left_out":76}
{"sheet":"競技者マスタ（上陸）","index":10,"n_rows":43,"n_cols":21,"rows_kept":43,"cut":false,"hidden":false,"merged":[]}
["男子",null,null,null,null,null,null,"女子"]
["ナンバー","競技者名","競技者名（ｶﾅ）","学年","所属","所属（カナ）",null,"ナンバー","競技者名","競技者名（ｶﾅ）","学年","所属","所属（カナ）",null,null,1,"秋田東",740,"秋田市立秋田東中学校","東","ﾋｶﾞｼ"]
[{"$f":"IF(新人入力!B11=\"\",\"\",新人入力!B11)","v":""},{"$f":"IF(新人入力!D11=\"\",\"\",新人入力!D11)","v":""},{"$f":"IF(新人入力!F11=\"\",\"\",新人入力!F11)","v":""},{"$f":"IF(新人入力!E11=\"\",\"\",新人入力!E11)","v":""},{"$f":"IF(新人入力!C11=\"\",\"\",新人入力!C11)","v":""},{"$f":"IF(E3=\"\",\"\",VLOOKUP(E3,$T$2:$U$34,2,FALSE))","v":""},null,{"$f":"IF(新人入力!B87=\"\",\"\",新人入力!B87)","v":""},{"$f":"IF(新人入力!D87=\"\",\"\",新人入力!D87)","v":""},{"$f":"IF(新人入力!F87=\"\",\"\",新人入力!F87)","v":""},{"$f":"IF(新人入力!E87=\"\",\"\",新人入力!E87)","v":""},{"$f":"IF(新人入力!C87=\"\",\"\",新人入力!C87)","v":""},{"$f":"IF(L3=\"\",\"\",VLOOKUP(L3,$T$2:$U$33,2,FALSE))","v":""},null,null,2,"秋田南",741,"秋田市立秋田南中学校","南","ﾐﾅﾐ"]
[{"$f":"IF(新人入力!B12=\"\",\"\",新人入力!B12)","v":""},{"$f":"IF(新人入力!D12=\"\",\"\",新人入力!D12)","v":""},{"$f":"IF(新人入力!F12=\"\",\"\",新人入力!F12)","v":""},{"$f":"IF(新人入力!E12=\"\",\"\",新人入力!E12)","v":""},{"$f":"IF(新人入力!C12=\"\",\"\",新人入力!C12)","v":""},{"$f":"IF(E4=\"\",\"\",VLOOKUP(E4,$T$2:$U$34,2,FALSE))","v":""},null,{"$f":"IF(新人入力!B88=\"\",\"\",新人入力!B88)","v":""},{"$f":"IF(新人入力!D88=\"\",\"\",新人入力!D88)","v":""},{"$f":"IF(新人入力!F88=\"\",\"\",新人入力!F88)","v":""},{"$f":"IF(新人入力!E88=\"\",\"\",新人入力!E88)","v":""},{"$f":"IF(新人入力!C88=\"\",\"\",新人入力!C88)","v":""},{"$f":"IF(L4=\"\",\"\",VLOOKUP(L4,$T$2:$U$33,2,FALSE))","v":""},null,null,3,"山王",742,"秋田市立山王中学校","山王","ｻﾝﾉｳ"]
[{"$f":"IF(新人入力!B13=\"\",\"\",新人入力!B13)","v":""},{"$f":"IF(新人入力!D13=\"\",\"\",新人入力!D13)","v":""},{"$f":"IF(新人入力!F13=\"\",\"\",新人入力!F13)","v":""},{"$f":"IF(新人入力!E13=\"\",\"\",新人入力!E13)","v":""},{"$f":"IF(新人入力!C13=\"\",\"\",新人入力!C13)","v":""},"",null,{"$f":"IF(新人入力!B89=\"\",\"\",新人入力!B89)","v":""},{"$f":"IF(新人入力!D89=\"\",\"\",新人入力!D89)","v":""},{"$f":"IF(新人入力!F89=\"\",\"\",新人入力!F89)","v":""},{"$f":"IF(新人入力!E89=\"\",\"\",新人入力!E89)","v":""},{"$f":"IF(新人入力!C89=\"\",\"\",新人入力!C89)","v":""},"",null,null,4,"土崎",743,"秋田市立土崎中学校","土崎","ﾂﾁｻﾞｷ"]
[{"$f":"IF(新人入力!B14=\"\",\"\",新人入力!B14)","v":""},{"$f":"IF(新人入力!D14=\"\",\"\",新人入力!D14)","v":""},{"$f":"IF(新人入力!F14=\"\",\"\",新人入力!F14)","v":""},{"$f":"IF(新人入力!E14=\"\",\"\",新人入力!E14)","v":""},{"$f":"IF(新人入力!C14=\"\",\"\",新人入力!C14)","v":""},"",null,{"$f":"IF(新人入力!B90=\"\",\"\",新人入力!B90)","v":""},{"$f":"IF(新人入力!D90=\"\",\"\",新人入力!D90)","v":""},{"$f":"IF(新人入力!F90=\"\",\"\",新人入力!F90)","v":""},{"$f":"IF(新人入力!E90=\"\",\"\",新人入力!E90)","v":""},{"$f":"IF(新人入力!C90=\"\",\"\",新人入力!C90)","v":""},"",null,null,5,"将軍野",744,"秋田市立将軍野中学校","将軍野","ｼｮｳｸﾞﾝﾉ"]
{"$rows_left_out":37}